From 470c059e691a4e7befa5e2a7ad0110a2b0055b50 Mon Sep 17 00:00:00 2001 From: Jakob Schikowski Date: Thu, 26 Nov 2020 21:15:15 +0100 Subject: libtest: Print the total time taken to execute a test suite --- src/test/rustdoc-ui/unparseable-doc-test.stdout | 10 +++++----- 1 file changed, 5 insertions(+), 5 deletions(-) (limited to 'src/test/rustdoc-ui/unparseable-doc-test.stdout') diff --git a/src/test/rustdoc-ui/unparseable-doc-test.stdout b/src/test/rustdoc-ui/unparseable-doc-test.stdout index 29cb22e2e4b..2641c66f25e 100644 --- a/src/test/rustdoc-ui/unparseable-doc-test.stdout +++ b/src/test/rustdoc-ui/unparseable-doc-test.stdout @@ -1,12 +1,12 @@ running 1 test -test $DIR/unparseable-doc-test.rs - foo (line 6) ... FAILED +test $DIR/unparseable-doc-test.rs - foo (line 7) ... FAILED failures: ----- $DIR/unparseable-doc-test.rs - foo (line 6) stdout ---- +---- $DIR/unparseable-doc-test.rs - foo (line 7) stdout ---- error[E0765]: unterminated double quote string - --> $DIR/unparseable-doc-test.rs:8:1 + --> $DIR/unparseable-doc-test.rs:9:1 | LL | "unterminated | ^^^^^^^^^^^^^ @@ -17,7 +17,7 @@ For more information about this error, try `rustc --explain E0765`. Couldn't compile the test. failures: - $DIR/unparseable-doc-test.rs - foo (line 6) + $DIR/unparseable-doc-test.rs - foo (line 7) -test result: FAILED. 0 passed; 1 failed; 0 ignored; 0 measured; 0 filtered out +test result: FAILED. 0 passed; 1 failed; 0 ignored; 0 measured; 0 filtered out; finished in $TIME -- cgit 1.4.1-3-g733a5