about summary refs log tree commit diff
path: root/tests/rustdoc-ui/doctest/dead-code-2024.stdout
diff options
context:
space:
mode:
Diffstat (limited to 'tests/rustdoc-ui/doctest/dead-code-2024.stdout')
-rw-r--r--tests/rustdoc-ui/doctest/dead-code-2024.stdout10
1 files changed, 5 insertions, 5 deletions
diff --git a/tests/rustdoc-ui/doctest/dead-code-2024.stdout b/tests/rustdoc-ui/doctest/dead-code-2024.stdout
index 69dd4e2ede1..a943a177e10 100644
--- a/tests/rustdoc-ui/doctest/dead-code-2024.stdout
+++ b/tests/rustdoc-ui/doctest/dead-code-2024.stdout
@@ -1,18 +1,18 @@
 
 running 1 test
-test $DIR/dead-code-2024.rs - f (line 12) - compile ... FAILED
+test $DIR/dead-code-2024.rs - f (line 13) - compile ... FAILED
 
 failures:
 
----- $DIR/dead-code-2024.rs - f (line 12) stdout ----
+---- $DIR/dead-code-2024.rs - f (line 13) stdout ----
 error: trait `T` is never used
-  --> $DIR/dead-code-2024.rs:13:7
+  --> $DIR/dead-code-2024.rs:14:7
    |
 LL | trait T { fn f(); }
    |       ^
    |
 note: the lint level is defined here
-  --> $DIR/dead-code-2024.rs:11:9
+  --> $DIR/dead-code-2024.rs:12:9
    |
 LL | #![deny(warnings)]
    |         ^^^^^^^^
@@ -23,7 +23,7 @@ error: aborting due to 1 previous error
 Couldn't compile the test.
 
 failures:
-    $DIR/dead-code-2024.rs - f (line 12)
+    $DIR/dead-code-2024.rs - f (line 13)
 
 test result: FAILED. 0 passed; 1 failed; 0 ignored; 0 measured; 0 filtered out; finished in $TIME